BDBM562665 Methyl 2-(4-((2-(pyrrolidin-1-yl)-6,7-dihydro-5H-cyclopenta[b]pyridin-4-yl)amino)phenyl)acetate hydrochloride::US11401286, Example 237
SMILES COC(=O)Cc1ccc(Nc2cc(nc3CCCc23)N2CCCC2)cc1
InChI Key InChIKey=ZZSSPZNPVHZHRB-UHFFFAOYSA-N
Data  2 IC50
  Tab Delimited (TSV)   2D SDfile   Computed 3D by Vconf -m prep SDfile
Find this compound or compounds like it in BindingDB:
Activity Spreadsheet -- Enzyme Inhibition Constant Data from BindingDB
Found 1 hit for monomerid = 562665
TargetcAMP-specific 3',5'-cyclic phosphodiesterase 4B [S133D](Homo sapiens (Human))
Tetra Discovery Partners
US Patent
LigandPNGBDBM562665(Methyl 2-(4-((2-(pyrrolidin-1-yl)-6,7-dihydro-5H-c...)
Affinity DataIC50: >1.00E+3nM. Assay description: Assays are performed in 96-well plates in a total volume of 200 μl/well. Compounds are dissolved in dimethylsulfoxide (DMSO) and added to plates...
Ligand InfoPC cidPC sid
In DepthDetails US Patent